{"text_format":"1","workbook":"xlsx","n_sheets":3,"sheets":["Scoresheet","SortLookup","Help"],"not_rendered":{"charts":0,"images":0,"macros":0,"external_links":0,"defined_names":2,"comments":0,"pivot_tables":0},"unopened":[],"bounds":{"document_bytes":16777216,"sheet_cells":100000,"rows_first":2000,"rows_last":500,"rows_between":2000,"halvings":0,"cell_chars":16384,"cell_head_chars":4096},"cells_cut":0,"cells_raw":0,"read":"whole","date_system":"1900"}

{"sheet":"Scoresheet","index":0,"n_rows":52,"n_cols":113,"rows_kept":52,"cut":false,"hidden":false,"merged":[[0,0,0,5],[0,80,0,90],[0,91,0,101],[0,10,0,14],[0,44,0,55],[0,15,0,30],[0,56,0,67],[0,102,0,112],[0,31,0,43],[0,8,0,9],[0,68,0,79]]}
["Competitor",null,null,null,null,null,"Rank?","Promote?","Sort Keys",null,"Match Totals",null,null,null,null,"Stage 1",null,null,null,null,null,null,null,null,null,null,null,null,null,null,null,"Stage 2",null,null,null,null,null,null,null,null,null,null,null,null,"Stage 3",null,null,null,null,null,null,null,null,null,null,null,"Stage 4",null,null,null,null,null,null,null,null,null,null,null,"Stage 5",null,null,null,null,null,null,null,null,null,null,null,"Stage 6",null,null,null,null,null,null,null,null,null,null,"Stage 7",null,null,null,null,null,null,null,null,null,null,"Stage 8"]
["Entry #","Name (Last, First)","IDPA #","Spl Cat","Div","Class","n","n","Sort Div","Sort Class","Total Match Score","Tot Raw Time","Tot Pen Time","Tot Pts Dn/2","Tot Pts Dn","Str 1 Raw Time","Str 2 Raw Time","Str 3 Raw Time","Str 4 Raw Time","Str 5 Raw Time","Str 6 Raw Time","Str 7 Raw Time","Pts Dn","PE","FTN","HNS","FTDR","Stage Raw Time","Pts Dn/2","Pen Sec","Total Stage Score","Str 1 Raw Time","Str 2 Raw Time","Str 3 Raw Time","Str 4 Raw Time","Pts Dn","PE","FTN","HNS","FTDR","Stage Raw Time","Pts Dn/2","Pen Sec","Total Stage Score","Str 1 Raw Time","Str 2 Raw Time","Str 3 Raw Time","Pts Dn","PE","FTN","HNS","FTDR","Stage Raw Time","Pts Dn/2","Pen Sec","Total Stage Score","Str 1 Raw Time","Str 2 Raw Time","Str 3 Raw Time","Pts Dn","PE","FTN","HNS","FTDR","Stage Raw Time","Pts Dn/2","Pen Sec","Total Stage Score","Str 1 Raw Time","Str 2 Raw Time","Str 3 Raw Time","Pts Dn","PE","FTN","HNS","FTDR","Stage Raw Time","Pts Dn/2","Pen Sec","Total Stage Score","Str 1 Raw Time","Str 2 Raw Time","Pts Dn","PE","FTN","HNS","FTDR","Stage Raw Time","Pts Dn/2","Pen Sec","Total Stage Score","Str 1 Raw Time","Str 2 Raw Time","Pts Dn","PE","FTN","HNS","FTDR","Stage Raw Time","Pts Dn/2","Pen Sec","Total Stage Score","Str 1 Raw Time","Str 2 Raw Time","Pts Dn","PE","FTN","HNS","FTDR","Stage Raw Time","Pts Dn/2","Pen Sec","Total Stage Score"]
[1,"Keith Porco",null,null,"ESP","SS",{"$f":"IF(AND(OR($G$2=\"Y\",$H$2=\"Y\"),I3<5,J3<5),IF(AND(I3=I2,J3=J2),G2+1,1),\"\")","v":""},{"$f":"IF(AND($H$2=\"Y\",J3>0,OR(AND(G3=1,G12=10),AND(G3=2,G21=20),AND(G3=3,G30=30),AND(G3=4,G39=40),AND(G3=5,G48=50),AND(G3=6,G57=60),AND(G3=7,G66=70),AND(G3=8,G75=80),AND(G3=9,G84=90),AND(G3=10,G93=100))),VLOOKUP(J3-1,SortLookup!$A$13:$B$16,2,FALSE),\"\")","v":""},{"$f":"IF(ISNA(VLOOKUP(E3,SortLookup!$A$1:$B$5,2,FALSE)),\" \",VLOOKUP(E3,SortLookup!$A$1:$B$5,2,FALSE))","v":1},{"$f":"IF(ISNA(VLOOKUP(F3,SortLookup!$A$7:$B$11,2,FALSE)),\" \",VLOOKUP(F3,SortLookup!$A$7:$B$11,2,FALSE))","v":2},{"$f":"L3+M3+N3","v":79.27},{"$f":"AB3+AO3+BA3+BM3+BY3+CJ3+CU3+DF3","v":70.27},{"$f":"AD3+AQ3+BC3+BO3+CA3+CL3+CW3+DH3","v":5},{"$f":"O3/2","v":4},{"$f":"W3+AJ3+AV3+BH3+BT3+CE3+CP3+DA3","v":8},25.02,null,null,null,null,null,null,0,null,null,null,null,{"$f":"P3+Q3+R3+S3+T3+U3+V3","v":25.02},{"$f":"W3/2","v":0},{"$f":"(X3*3)+(Y3*5)+(Z3*5)+(AA3*20)","v":0},{"$f":"AB3+AC3+AD3","v":25.02},8.5,null,null,null,1,null,null,null,null,{"$f":"AF3+AG3+AH3+AI3","v":8.5},{"$f":"AJ3/2","v":0.5},{"$f":"(AK3*3)+(AL3*5)+(AM3*5)+(AN3*20)","v":0},{"$f":"AO3+AP3+AQ3","v":9},19.68,null,null,3,null,null,null,null,{"$f":"AS3+AT3+AU3","v":19.68},{"$f":"AV3/2","v":1.5},{"$f":"(AW3*3)+(AX3*5)+(AY3*5)+(AZ3*20)","v":0},{"$f":"BA3+BB3+BC3","v":21.18},17.07,null,null,4,null,null,1,null,{"$f":"BE3+BF3+BG3","v":17.07},{"$f":"BH3/2","v":2},{"$f":"(BI3*3)+(BJ3*5)+(BK3*5)+(BL3*20)","v":5},{"$f":"BM3+BN3+BO3","v":24.07},null,null,null,null,null,null,null,null,{"$f":"BQ3+BR3+BS3","v":0},{"$f":"BT3/2","v":0},{"$f":"(BU3*3)+(BV3*5)+(BW3*5)+(BX3*20)","v":0},{"$f":"BY3+BZ3+CA3","v":0},null,null,null,null,null,null,null,{"$f":"CC3+CD3","v":0},{"$f":"CE3/2","v":0},{"$f":"(CF3*3)+(CG3*5)+(CH3*5)+(CI3*20)","v":0},{"$f":"CJ3+CK3+CL3","v":0},null,null,null,null,null,null,null,{"$f":"CN3+CO3","v":0},{"$f":"CP3/2","v":0},{"$f":"(CQ3*3)+(CR3*5)+(CS3*5)+(CT3*20)","v":0},{"$f":"CU3+CV3+CW3","v":0},null,null,null,null,null,null,null,{"$f":"CY3+CZ3","v":0},{"$f":"DA3/2","v":0},{"$f":"(DB3*3)+(DC3*5)+(DD3*5)+(DE3*20)","v":0},{"$f":"DF3+DG3+DH3","v":0}]
[2,"Gene Villella",null,null,"ESP","SS",{"$f":"IF(AND(OR($G$2=\"Y\",$H$2=\"Y\"),I4<5,J4<5),IF(AND(I4=I3,J4=J3),G3+1,1),\"\")","v":""},{"$f":"IF(AND($H$2=\"Y\",J4>0,OR(AND(G4=1,G13=10),AND(G4=2,G22=20),AND(G4=3,G31=30),AND(G4=4,G40=40),AND(G4=5,G49=50),AND(G4=6,G58=60),AND(G4=7,G67=70),AND(G4=8,G76=80),AND(G4=9,G85=90),AND(G4=10,G94=100))),VLOOKUP(J4-1,SortLookup!$A$13:$B$16,2,FALSE),\"\")","v":""},{"$f":"IF(ISNA(VLOOKUP(E4,SortLookup!$A$1:$B$5,2,FALSE)),\" \",VLOOKUP(E4,SortLookup!$A$1:$B$5,2,FALSE))","v":1},{"$f":"IF(ISNA(VLOOKUP(F4,SortLookup!$A$7:$B$11,2,FALSE)),\" \",VLOOKUP(F4,SortLookup!$A$7:$B$11,2,FALSE))","v":2},104.47,94.47,5,5,10,29.6,null,null,null,null,null,null,0,null,null,null,null,29.6,0,0,{"$f":"AB4+AC4+AD4","v":29.6},7.32,null,null,null,4,null,null,null,null,7.32,2,0,{"$f":"AO4+AP4+AQ4","v":9.32},28.03,null,null,0,null,null,null,null,28.03,0,0,{"$f":"BA4+BB4+BC4","v":28.03},29.52,null,null,6,null,null,1,null,29.52,3,5,{"$f":"BM4+BN4+BO4","v":37.520000000000003},null,null,null,null,null,null,null,null,0,0,0,{"$f":"BY4+BZ4+CA4","v":0},null,null,null,null,null,null,null,0,0,0,{"$f":"CJ4+CK4+CL4","v":0},null,null,null,null,null,null,null,0,0,0,{"$f":"CU4+CV4+CW4","v":0},null,null,null,null,null,null,null,0,0,0,{"$f":"DF4+DG4+DH4","v":0}]
[3,"Terry Hanes",null,null,"ESP","SS",{"$f":"IF(AND(OR($G$2=\"Y\",$H$2=\"Y\"),I5<5,J5<5),IF(AND(I5=I4,J5=J4),G4+1,1),\"\")","v":""},{"$f":"IF(AND($H$2=\"Y\",J5>0,OR(AND(G5=1,G14=10),AND(G5=2,G23=20),AND(G5=3,G32=30),AND(G5=4,G41=40),AND(G5=5,G50=50),AND(G5=6,G59=60),AND(G5=7,G68=70),AND(G5=8,G77=80),AND(G5=9,G86=90),AND(G5=10,G95=100))),VLOOKUP(J5-1,SortLookup!$A$13:$B$16,2,FALSE),\"\")","v":""},{"$f":"IF(ISNA(VLOOKUP(E5,SortLookup!$A$1:$B$5,2,FALSE)),\" \",VLOOKUP(E5,SortLookup!$A$1:$B$5,2,FALSE))","v":1},{"$f":"IF(ISNA(VLOOKUP(F5,SortLookup!$A$7:$B$11,2,FALSE)),\" \",VLOOKUP(F5,SortLookup!$A$7:$B$11,2,FALSE))","v":2},72.739999999999995,68.239999999999995,0,4.5,9,20.72,null,null,null,null,null,null,1,null,null,null,null,20.72,0.5,0,21.22,8.36,null,null,null,1,null,null,null,null,8.36,0.5,0,8.86,25.19,null,null,3,null,null,null,null,25.19,1.5,0,26.69,13.97,null,null,4,null,null,null,null,13.97,2,0,15.97,null,null,null,null,null,null,null,null,0,0,0,0,null,null,null,null,null,null,null,0,0,0,0,null,null,null,null,null,null,null,0,0,0,0,null,null,null,null,null,null,null,0,0,0,0]
[4,"Jerry Williams",null,null,"ESP","UN",{"$f":"IF(AND(OR($G$2=\"Y\",$H$2=\"Y\"),I6<5,J6<5),IF(AND(I6=I5,J6=J5),G5+1,1),\"\")","v":""},{"$f":"IF(AND($H$2=\"Y\",J6>0,OR(AND(G6=1,G15=10),AND(G6=2,G24=20),AND(G6=3,G33=30),AND(G6=4,G42=40),AND(G6=5,G51=50),AND(G6=6,G60=60),AND(G6=7,G69=70),AND(G6=8,G78=80),AND(G6=9,G87=90),AND(G6=10,G96=100))),VLOOKUP(J6-1,SortLookup!$A$13:$B$16,2,FALSE),\"\")","v":""},{"$f":"IF(ISNA(VLOOKUP(E6,SortLookup!$A$1:$B$5,2,FALSE)),\" \",VLOOKUP(E6,SortLookup!$A$1:$B$5,2,FALSE))","v":1},{"$f":"IF(ISNA(VLOOKUP(F6,SortLookup!$A$7:$B$11,2,FALSE)),\" \",VLOOKUP(F6,SortLookup!$A$7:$B$11,2,FALSE))","v":" "},120.26,115.26,0,5,10,40.74,null,null,null,null,null,null,1,null,null,null,null,40.74,0.5,0,41.24,10.44,null,null,null,0,null,null,null,null,10.44,0,0,10.44,34.03,null,null,1,null,null,null,null,34.03,0.5,0,34.53,30.05,null,null,8,null,null,null,null,30.05,4,0,34.049999999999997,null,null,null,null,null,null,null,null,0,0,0,0,null,null,null,null,null,null,null,0,0,0,0,null,null,null,null,null,null,null,0,0,0,0,null,null,null,null,null,null,null,0,0,0,0]
[5,"Paul Day",null,null,"ESP","SS","",{"$f":"IF(AND($H$2=\"Y\",J7>0,OR(AND(G7=1,G16=10),AND(G7=2,G25=20),AND(G7=3,G34=30),AND(G7=4,G43=40),AND(G7=5,G52=50),AND(G7=6,G61=60),AND(G7=7,G70=70),AND(G7=8,G79=80),AND(G7=9,G88=90),AND(G7=10,G97=100))),VLOOKUP(J7-1,SortLookup!$A$13:$B$16,2,FALSE),\"\")","v":""},{"$f":"IF(ISNA(VLOOKUP(E7,SortLookup!$A$1:$B$5,2,FALSE)),\" \",VLOOKUP(E7,SortLookup!$A$1:$B$5,2,FALSE))","v":1},{"$f":"IF(ISNA(VLOOKUP(F7,SortLookup!$A$7:$B$11,2,FALSE)),\" \",VLOOKUP(F7,SortLookup!$A$7:$B$11,2,FALSE))","v":2},87.88,82.88,0,5,10,26.86,null,null,null,null,null,null,1,null,null,null,null,26.86,0.5,0,27.36,11.77,null,null,null,2,null,null,null,null,11.77,1,0,12.77,23.96,null,null,5,null,null,null,null,23.96,2.5,0,26.46,20.29,null,null,2,null,null,null,null,20.29,1,0,21.29,null,null,null,null,null,null,null,null,0,0,0,0,null,null,null,null,null,null,null,0,0,0,0,null,null,null,null,null,null,null,0,0,0,0,null,null,null,null,null,null,null,0,0,0,0]
[6,"Brandon Williams",null,null,"ESP","UN","",{"$f":"IF(AND($H$2=\"Y\",J8>0,OR(AND(G8=1,G17=10),AND(G8=2,G26=20),AND(G8=3,G35=30),AND(G8=4,G44=40),AND(G8=5,G53=50),AND(G8=6,G62=60),AND(G8=7,G71=70),AND(G8=8,G80=80),AND(G8=9,G89=90),AND(G8=10,G98=100))),VLOOKUP(J8-1,SortLookup!$A$13:$B$16,2,FALSE),\"\")","v":""},{"$f":"IF(ISNA(VLOOKUP(E8,SortLookup!$A$1:$B$5,2,FALSE)),\" \",VLOOKUP(E8,SortLookup!$A$1:$B$5,2,FALSE))","v":1},{"$f":"IF(ISNA(VLOOKUP(F8,SortLookup!$A$7:$B$11,2,FALSE)),\" \",VLOOKUP(F8,SortLookup!$A$7:$B$11,2,FALSE))","v":" "},163.44,137.44,5,21,42,53.24,null,null,null,null,null,null,7,null,null,null,null,53.24,3.5,0,56.74,15.74,null,null,null,2,null,null,null,null,15.74,1,0,16.739999999999998,39.25,null,null,24,null,null,null,null,39.25,12,0,51.25,29.21,null,null,9,null,null,1,null,29.21,4.5,5,38.71,null,null,null,null,null,null,null,null,0,0,0,0,null,null,null,null,null,null,null,0,0,0,0,null,null,null,null,null,null,null,0,0,0,0,null,null,null,null,null,null,null,0,0,0,0]
[7,"John Connacher",null,null,"ESP","NV","",{"$f":"IF(AND($H$2=\"Y\",J9>0,OR(AND(G9=1,G18=10),AND(G9=2,G27=20),AND(G9=3,G36=30),AND(G9=4,G45=40),AND(G9=5,G54=50),AND(G9=6,G63=60),AND(G9=7,G72=70),AND(G9=8,G81=80),AND(G9=9,G90=90),AND(G9=10,G99=100))),VLOOKUP(J9-1,SortLookup!$A$13:$B$16,2,FALSE),\"\")","v":""},{"$f":"IF(ISNA(VLOOKUP(E9,SortLookup!$A$1:$B$5,2,FALSE)),\" \",VLOOKUP(E9,SortLookup!$A$1:$B$5,2,FALSE))","v":1},{"$f":"IF(ISNA(VLOOKUP(F9,SortLookup!$A$7:$B$11,2,FALSE)),\" \",VLOOKUP(F9,SortLookup!$A$7:$B$11,2,FALSE))","v":4},187.57,163.57,10,14,28,55.75,null,null,null,null,null,null,8,null,null,null,null,55.75,4,0,59.75,20.9,null,null,null,1,null,null,null,null,20.9,0.5,0,21.4,54.69,null,null,17,null,null,null,null,54.69,8.5,0,63.19,32.229999999999997,null,null,2,null,null,2,null,32.229999999999997,1,10,43.23,null,null,null,null,null,null,null,null,0,0,0,0,null,null,null,null,null,null,null,0,0,0,0,null,null,null,null,null,null,null,0,0,0,0,null,null,null,null,null,null,null,0,0,0,0]
[8,"Jim Shipley",null,null,"ESP","UN","",{"$f":"IF(AND($H$2=\"Y\",J10>0,OR(AND(G10=1,G19=10),AND(G10=2,G28=20),AND(G10=3,G37=30),AND(G10=4,G46=40),AND(G10=5,G55=50),AND(G10=6,G64=60),AND(G10=7,G73=70),AND(G10=8,G82=80),AND(G10=9,G91=90),AND(G10=10,G100=100))),VLOOKUP(J10-1,SortLookup!$A$13:$B$16,2,FALSE),\"\")","v":""},{"$f":"IF(ISNA(VLOOKUP(E10,SortLookup!$A$1:$B$5,2,FALSE)),\" \",VLOOKUP(E10,SortLookup!$A$1:$B$5,2,FALSE))","v":1},{"$f":"IF(ISNA(VLOOKUP(F10,SortLookup!$A$7:$B$11,2,FALSE)),\" \",VLOOKUP(F10,SortLookup!$A$7:$B$11,2,FALSE))","v":" "},90.89,70.39,8,12.5,25,22.49,null,null,null,null,null,null,6,1,null,null,null,22.49,3,3,28.49,9.06,null,null,null,5,null,null,null,null,9.06,2.5,0,11.56,22.76,null,null,3,null,null,null,null,22.76,1.5,0,24.26,16.079999999999998,null,null,11,null,1,null,null,16.079999999999998,5.5,5,26.58,null,null,null,null,null,null,null,null,0,0,0,0,null,null,null,null,null,null,null,0,0,0,0,null,null,null,null,null,null,null,0,0,0,0,null,null,null,null,null,null,null,0,0,0,0]
[9,"Austin Steele",null,null,"ESP","UN","",{"$f":"IF(AND($H$2=\"Y\",J11>0,OR(AND(G11=1,G20=10),AND(G11=2,G29=20),AND(G11=3,G38=30),AND(G11=4,G47=40),AND(G11=5,G56=50),AND(G11=6,G65=60),AND(G11=7,G74=70),AND(G11=8,G83=80),AND(G11=9,G92=90),AND(G11=10,G101=100))),VLOOKUP(J11-1,SortLookup!$A$13:$B$16,2,FALSE),\"\")","v":""},{"$f":"IF(ISNA(VLOOKUP(E11,SortLookup!$A$1:$B$5,2,FALSE)),\" \",VLOOKUP(E11,SortLookup!$A$1:$B$5,2,FALSE))","v":1},{"$f":"IF(ISNA(VLOOKUP(F11,SortLookup!$A$7:$B$11,2,FALSE)),\" \",VLOOKUP(F11,SortLookup!$A$7:$B$11,2,FALSE))","v":" "},115.99,70.989999999999995,13,32,64,25.6,null,null,null,null,null,null,23,1,null,null,null,25.6,11.5,3,40.1,7.94,null,null,null,5,null,null,null,null,7.94,2.5,0,10.44,19.63,null,null,18,null,null,null,null,19.63,9,0,28.63,17.82,null,null,18,null,1,1,null,17.82,9,10,36.82,null,null,null,null,null,null,null,null,0,0,0,0,null,null,null,null,null,null,null,0,0,0,0,null,null,null,null,null,null,null,0,0,0,0,null,null,null,null,null,null,null,0,0,0,0]
[10,"Chris Kline",null,null,"ESP","UN","",{"$f":"IF(AND($H$2=\"Y\",J12>0,OR(AND(G12=1,G21=10),AND(G12=2,G30=20),AND(G12=3,G39=30),AND(G12=4,G48=40),AND(G12=5,G57=50),AND(G12=6,G66=60),AND(G12=7,G75=70),AND(G12=8,G84=80),AND(G12=9,G93=90),AND(G12=10,G102=100))),VLOOKUP(J12-1,SortLookup!$A$13:$B$16,2,FALSE),\"\")","v":""},{"$f":"IF(ISNA(VLOOKUP(E12,SortLookup!$A$1:$B$5,2,FALSE)),\" \",VLOOKUP(E12,SortLookup!$A$1:$B$5,2,FALSE))","v":1},{"$f":"IF(ISNA(VLOOKUP(F12,SortLookup!$A$7:$B$11,2,FALSE)),\" \",VLOOKUP(F12,SortLookup!$A$7:$B$11,2,FALSE))","v":" "},110.69,91.19,8,11.5,23,29.33,null,null,null,null,null,null,5,null,null,null,null,29.33,2.5,0,31.83,11.35,null,null,null,1,null,null,null,null,11.35,0.5,0,11.85,31.24,null,null,12,1,null,null,null,31.24,6,3,40.24,19.27,null,null,5,null,null,1,null,19.27,2.5,5,26.77,null,null,null,null,null,null,null,null,0,0,0,0,null,null,null,null,null,null,null,0,0,0,0,null,null,null,null,null,null,null,0,0,0,0,null,null,null,null,null,null,null,0,0,0,0]
[11,"Wayne Steele",null,null,"ESP","UN","",{"$f":"IF(AND($H$2=\"Y\",J13>0,OR(AND(G13=1,G22=10),AND(G13=2,G31=20),AND(G13=3,G40=30),AND(G13=4,G49=40),AND(G13=5,G58=50),AND(G13=6,G67=60),AND(G13=7,G76=70),AND(G13=8,G85=80),AND(G13=9,G94=90),AND(G13=10,G103=100))),VLOOKUP(J13-1,SortLookup!$A$13:$B$16,2,FALSE),\"\")","v":""},{"$f":"IF(ISNA(VLOOKUP(E13,SortLookup!$A$1:$B$5,2,FALSE)),\" \",VLOOKUP(E13,SortLookup!$A$1:$B$5,2,FALSE))","v":1},{"$f":"IF(ISNA(VLOOKUP(F13,SortLookup!$A$7:$B$11,2,FALSE)),\" \",VLOOKUP(F13,SortLookup!$A$7:$B$11,2,FALSE))","v":" "},{"$error":"#VALUE!"},{"$error":"#VALUE!"},3,5.5,11,24.04,null,null,null,null,null,null,3,1,null,null,null,24.04,1.5,3,28.54,7.91,null,null,null,1,null,null,null,null,7.91,0.5,0,8.41,20.57,null,null,7,null,null,null,null,20.57,3.5,0,24.07,"DNF",null,null,null,null,null,null,null,{"$error":"#VALUE!"},0,0,{"$error":"#VALUE!"},null,null,null,null,null,null,null,null,0,0,0,0,null,null,null,null,null,null,null,0,0,0,0,null,null,null,null,null,null,null,0,0,0,0,null,null,null,null,null,null,null,0,0,0,0]
[12,"Bob (FTR) Rogan",null,null,"ESP","UN","",{"$f":"IF(AND($H$2=\"Y\",J14>0,OR(AND(G14=1,G23=10),AND(G14=2,G32=20),AND(G14=3,G41=30),AND(G14=4,G50=40),AND(G14=5,G59=50),AND(G14=6,G68=60),AND(G14=7,G77=70),AND(G14=8,G86=80),AND(G14=9,G95=90),AND(G14=10,G104=100))),VLOOKUP(J14-1,SortLookup!$A$13:$B$16,2,FALSE),\"\")","v":""},{"$f":"IF(ISNA(VLOOKUP(E14,SortLookup!$A$1:$B$5,2,FALSE)),\" \",VLOOKUP(E14,SortLookup!$A$1:$B$5,2,FALSE))","v":1},{"$f":"IF(ISNA(VLOOKUP(F14,SortLookup!$A$7:$B$11,2,FALSE)),\" \",VLOOKUP(F14,SortLookup!$A$7:$B$11,2,FALSE))","v":" "},102.87,90.37,0,12.5,25,30.28,null,null,null,null,null,null,9,null,null,null,null,30.28,4.5,0,34.78,11.54,null,null,null,3,null,null,null,null,11.54,1.5,0,13.04,27.34,null,null,4,null,null,null,null,27.34,2,0,29.34,21.21,null,null,9,null,null,null,null,21.21,4.5,0,25.71,null,null,null,null,null,null,null,null,0,0,0,0,null,null,null,null,null,null,null,0,0,0,0,null,null,null,null,null,null,null,0,0,0,0,null,null,null,null,null,null,null,0,0,0,0]
[13,null,null,null,null,null,"",{"$f":"IF(AND($H$2=\"Y\",J15>0,OR(AND(G15=1,G24=10),AND(G15=2,G33=20),AND(G15=3,G42=30),AND(G15=4,G51=40),AND(G15=5,G60=50),AND(G15=6,G69=60),AND(G15=7,G78=70),AND(G15=8,G87=80),AND(G15=9,G96=90),AND(G15=10,G105=100))),VLOOKUP(J15-1,SortLookup!$A$13:$B$16,2,FALSE),\"\")","v":""},{"$f":"IF(ISNA(VLOOKUP(E15,SortLookup!$A$1:$B$5,2,FALSE)),\" \",VLOOKUP(E15,SortLookup!$A$1:$B$5,2,FALSE))","v":" "},{"$f":"IF(ISNA(VLOOKUP(F15,SortLookup!$A$7:$B$11,2,FALSE)),\" \",VLOOKUP(F15,SortLookup!$A$7:$B$11,2,FALSE))","v":" "},0,0,0,0,0,null,null,null,null,null,null,null,null,null,null,null,null,0,0,0,0,null,null,null,null,null,null,null,null,null,0,0,0,0,null,null,null,null,null,null,null,null,0,0,0,0,null,null,null,null,null,null,null,null,0,0,0,0,null,null,null,null,null,null,null,null,0,0,0,0,null,null,null,null,null,null,null,0,0,0,0,null,null,null,null,null,null,null,0,0,0,0,null,null,null,null,null,null,null,0,0,0,0]
[14,null,null,null,null,null,"",{"$f":"IF(AND($H$2=\"Y\",J16>0,OR(AND(G16=1,G25=10),AND(G16=2,G34=20),AND(G16=3,G43=30),AND(G16=4,G52=40),AND(G16=5,G61=50),AND(G16=6,G70=60),AND(G16=7,G79=70),AND(G16=8,G88=80),AND(G16=9,G97=90),AND(G16=10,G106=100))),VLOOKUP(J16-1,SortLookup!$A$13:$B$16,2,FALSE),\"\")","v":""},{"$f":"IF(ISNA(VLOOKUP(E16,SortLookup!$A$1:$B$5,2,FALSE)),\" \",VLOOKUP(E16,SortLookup!$A$1:$B$5,2,FALSE))","v":" "},{"$f":"IF(ISNA(VLOOKUP(F16,SortLookup!$A$7:$B$11,2,FALSE)),\" \",VLOOKUP(F16,SortLookup!$A$7:$B$11,2,FALSE))","v":" "},0,0,0,0,0,null,null,null,null,null,null,null,null,null,null,null,null,0,0,0,0,null,null,null,null,null,null,null,null,null,0,0,0,0,null,null,null,null,null,null,null,null,0,0,0,0,null,null,null,null,null,null,null,null,0,0,0,0,null,null,null,null,null,null,null,null,0,0,0,0,null,null,null,null,null,null,null,0,0,0,0,null,null,null,null,null,null,null,0,0,0,0,null,null,null,null,null,null,null,0,0,0,0]
[15,"Bruce Wehler",null,null,"CDP","UN","",{"$f":"IF(AND($H$2=\"Y\",J17>0,OR(AND(G17=1,G26=10),AND(G17=2,G35=20),AND(G17=3,G44=30),AND(G17=4,G53=40),AND(G17=5,G62=50),AND(G17=6,G71=60),AND(G17=7,G80=70),AND(G17=8,G89=80),AND(G17=9,G98=90),AND(G17=10,G107=100))),VLOOKUP(J17-1,SortLookup!$A$13:$B$16,2,FALSE),\"\")","v":""},{"$f":"IF(ISNA(VLOOKUP(E17,SortLookup!$A$1:$B$5,2,FALSE)),\" \",VLOOKUP(E17,SortLookup!$A$1:$B$5,2,FALSE))","v":2},{"$f":"IF(ISNA(VLOOKUP(F17,SortLookup!$A$7:$B$11,2,FALSE)),\" \",VLOOKUP(F17,SortLookup!$A$7:$B$11,2,FALSE))","v":" "},126.19,98.19,5,23,46,31.01,null,null,null,null,null,null,9,null,null,null,null,31.01,4.5,0,35.51,10.61,null,null,null,5,null,null,null,null,10.61,2.5,0,13.11,32.119999999999997,null,null,18,null,null,null,null,32.119999999999997,9,0,41.12,24.45,null,null,14,null,1,null,null,24.45,7,5,36.450000000000003,null,null,null,null,null,null,null,null,0,0,0,0,null,null,null,null,null,null,null,0,0,0,0,null,null,null,null,null,null,null,0,0,0,0,null,null,null,null,null,null,null,0,0,0,0]
[16,"Duane Schmader",null,null,"CDP","UN","",{"$f":"IF(AND($H$2=\"Y\",J18>0,OR(AND(G18=1,G27=10),AND(G18=2,G36=20),AND(G18=3,G45=30),AND(G18=4,G54=40),AND(G18=5,G63=50),AND(G18=6,G72=60),AND(G18=7,G81=70),AND(G18=8,G90=80),AND(G18=9,G99=90),AND(G18=10,G108=100))),VLOOKUP(J18-1,SortLookup!$A$13:$B$16,2,FALSE),\"\")","v":""},{"$f":"IF(ISNA(VLOOKUP(E18,SortLookup!$A$1:$B$5,2,FALSE)),\" \",VLOOKUP(E18,SortLookup!$A$1:$B$5,2,FALSE))","v":2},{"$f":"IF(ISNA(VLOOKUP(F18,SortLookup!$A$7:$B$11,2,FALSE)),\" \",VLOOKUP(F18,SortLookup!$A$7:$B$11,2,FALSE))","v":" "},165.24,130.24,15,20,40,43.16,null,null,null,null,null,null,2,null,null,null,null,43.16,1,0,44.16,13.13,null,null,null,11,null,1,null,null,13.13,5.5,5,23.63,45.05,null,null,12,null,null,null,null,45.05,6,0,51.05,28.9,null,null,15,null,1,1,null,28.9,7.5,10,46.4,null,null,null,null,null,null,null,null,0,0,0,0,null,null,null,null,null,null,null,0,0,0,0,null,null,null,null,null,null,null,0,0,0,0,null,null,null,null,null,null,null,0,0,0,0]
[17,"Joe Wortman",null,null,"CDP","MM","",{"$f":"IF(AND($H$2=\"Y\",J19>0,OR(AND(G19=1,G28=10),AND(G19=2,G37=20),AND(G19=3,G46=30),AND(G19=4,G55=40),AND(G19=5,G64=50),AND(G19=6,G73=60),AND(G19=7,G82=70),AND(G19=8,G91=80),AND(G19=9,G100=90),AND(G19=10,G109=100))),VLOOKUP(J19-1,SortLookup!$A$13:$B$16,2,FALSE),\"\")","v":""},{"$f":"IF(ISNA(VLOOKUP(E19,SortLookup!$A$1:$B$5,2,FALSE)),\" \",VLOOKUP(E19,SortLookup!$A$1:$B$5,2,FALSE))","v":2},{"$f":"IF(ISNA(VLOOKUP(F19,SortLookup!$A$7:$B$11,2,FALSE)),\" \",VLOOKUP(F19,SortLookup!$A$7:$B$11,2,FALSE))","v":3},98.57,91.07,0,7.5,15,27.52,null,null,null,null,null,null,1,null,null,null,null,27.52,0.5,0,28.02,9.09,null,null,null,0,null,null,null,null,9.09,0,0,9.09,29.33,null,null,13,null,null,null,null,29.33,6.5,0,35.83,25.13,null,null,1,null,null,null,null,25.13,0.5,0,25.63,null,null,null,null,null,null,null,null,0,0,0,0,null,null,null,null,null,null,null,0,0,0,0,null,null,null,null,null,null,null,0,0,0,0,null,null,null,null,null,null,null,0,0,0,0]
[18,"Ed Novak",null,null,"CDP","NV","",{"$f":"IF(AND($H$2=\"Y\",J20>0,OR(AND(G20=1,G29=10),AND(G20=2,G38=20),AND(G20=3,G47=30),AND(G20=4,G56=40),AND(G20=5,G65=50),AND(G20=6,G74=60),AND(G20=7,G83=70),AND(G20=8,G92=80),AND(G20=9,G101=90),AND(G20=10,G110=100))),VLOOKUP(J20-1,SortLookup!$A$13:$B$16,2,FALSE),\"\")","v":""},{"$f":"IF(ISNA(VLOOKUP(E20,SortLookup!$A$1:$B$5,2,FALSE)),\" \",VLOOKUP(E20,SortLookup!$A$1:$B$5,2,FALSE))","v":2},{"$f":"IF(ISNA(VLOOKUP(F20,SortLookup!$A$7:$B$11,2,FALSE)),\" \",VLOOKUP(F20,SortLookup!$A$7:$B$11,2,FALSE))","v":4},152.44,125.94,9,17.5,35,44.54,null,null,null,null,null,null,18,2,null,null,null,44.54,9,6,59.54,7.02,null,null,null,1,null,null,null,null,7.02,0.5,0,7.52,40.29,null,null,3,null,null,null,null,40.29,1.5,0,41.79,34.090000000000003,null,null,13,1,null,null,null,34.090000000000003,6.5,3,43.59,null,null,null,null,null,null,null,null,0,0,0,0,null,null,null,null,null,null,null,0,0,0,0,null,null,null,null,null,null,null,0,0,0,0,null,null,null,null,null,null,null,0,0,0,0]
{"$rows_left_out":33}
{"sheet":"SortLookup","index":1,"n_rows":17,"n_cols":3,"rows_kept":17,"cut":false,"hidden":false,"merged":[]}
["SSP",0,"IDPA Match Scoring Spreadsheet Sort Key lookup table"]
["ESP",1,"Table used to convert IDPA Divisions and classes into numeric sort keys."]
["CDP",2,"The sort keys can then be used with the total match scores to produce a sort by score within division and class."]
["ESR",3,"The shooter's division is looked up in the upper table and converted to anumber."]
["SSR",4,"Then his or her class is looked up in the lower table and converted to a number."]
[]
["MA",0,"A three-column sort on the division sort key first, class sort key next, and total match score third will yield a properly-ordered report."]
["EX",1]
["SS",2]
["MM",3]
["NV",4]
[]
[0,"MA","This table is used to look up IDPA Classes using the numeric Class Sort Key value for purposes of promotions at sanctioned matches."]
[1,"EX"]
[2,"SS"]
[3,"MM"]
[4," ","Invalid Shooter Class entered on spreadsheet!"]

{"sheet":"Help","index":2,"n_rows":31,"n_cols":1,"rows_kept":31,"cut":false,"hidden":false,"merged":[]}
["Help and instructions for this spreadsheet are available on the CCIDPA web site at http://www.ccidpa.org/scoring/spreadsheets.html"]
[]
[]
["If you delete rows in the scoring spreadsheet, and column H \"blows up\" with #REF! errors, replace the formulas in column H:"]
["(Remember to add the equal sign at the beginning of this formula!)"]
[]
["   1. Unprotect the scoring worksheet using Tools->Protection->Unprotect Sheet. "]
["   2. Select this Help worksheet, and copy the formula below."]
["   3. Return to the scoring worksheet."]
["   4. Paste the copied formula into cell H3, and add an equal sign to the beginning of it."]
["   5. Left-click and select the cell at location H3."]
["   6. Place the cursor on the little black box that appears at the bottom right of cell H3. "]
["   7. Press and hold the left mouse button, and drag the little black box all the way down to the last active row of your spreadsheet. "]
["   8. Re-protect the worksheet using Tools->Protection->Protect Sheet. Uncheck all boxes, except for \"Select unlocked cells.\" "]
[]
["IF(AND($H$2=\"Y\",J3>0,OR(AND(G3=1,G12=10),AND(G3=2,G21=20),AND(G3=3,G30=30),AND(G3=4,G39=40),AND(G3=5,G48=50),AND(G3=6,G57=60),AND(G3=7,G66=70),AND(G3=8,G75=80),AND(G3=9,G84=90),AND(G3=10,G93=100))),VLOOKUP(J3-1,SortLookup!$A$12:$B$15,2,FALSE),\"\")"]
[]
[]
["The Match Ranking and Match Promotion features (columns G and H) won't work properly until you have sorted your results by Division, Class, and Total Match Score."]
[]
{"$rows_left_out":11}